{"text_format":"3","workbook":"xlsx","n_sheets":3,"sheets":["Sheet1","Sheet2","Sheet3"],"not_rendered":{"charts":1,"defined_names":10,"comments":1},"read":"whole","date_system":"1900"}

{"sheet":"Sheet1","index":0,"n_rows":40,"n_cols":11,"rows_kept":40}
["     Taylor Approximations to Polar Curves"]
[]
[null,"      This graphing utility produces the graphs"]
[null,"                  of any polar curve based on "]
[null,null,"                  r = f(Q)    "]
[null," and the curve for the Taylor polynomial based on",{"$nulls":4}," "]
[null,null,"                 r = g(Q) "]
[null,"         on any interval from Q = a  to Q = b."]
[]
["Enter the f(Q) function in terms of Q:   r = f(Q) =  ",{"$nulls":4},"sin(Q)"]
[]
[]
["Enter the Taylor approximation to f in terms of Q:    "]
[{"$nulls":4},"  r = g(Q) =  ","Q-Q^3/6+Q^5/120 "]
[]
[]
[]
["Now enter the interval for Q:  "]
[null,"Starting value Q = a =",null,-2]
[null,"Ending value Q = b =",null,3]
[]
[]
[{"$nulls":8},"The graph of the polar function"]
[{"$nulls":9},"r =",{"$f":"F10","v":"sin(Q)"}]
[]
["Click each item below for suggestions and investigations"]
[null,null,"   Item 1",{"$nulls":5},"Now trace along the polar curve:"]
[null,null,"   Item 2",{"$nulls":5},"Q  = ",{"$f":"D19+K28*Sheet2!B12","v":{"v":-1.8602794411177646,"d":"-1.860"}},14]
[null,null,"   Item 3",{"$nulls":5},"r =",{"$f":"LOOKUP(J28,Sheet2!C3:C504,Sheet2!D3:D504)","v":{"v":-0.9554950002214384,"d":"-0.955"}}]
[]
[{"$nulls":8},"Along the approximating Taylor function:"]
[{"$nulls":8},"r =",{"$f":"LOOKUP($J28,Sheet2!C3:C503,Sheet2!G3:G503)","v":{"v":-0.9706286321814167,"d":"-0.971"}}]
["To access/download all the DIGMath Apps for Numerical Analysis"]
["Click this link:",null,"https://we-dig-math.org/dynamic-numerical-analysis.htm"]
[]
["Created by:  Sheldon P. Gordon    © 2026"]
["                      Farmingdale State College    "]
["Development of this module was supported by the "]
["NSF's Division of Undergraduate Education  "]
["under grants DUE-0310123 and DUE-0442160."]

{"sheet":"Sheet2","index":1,"n_rows":504,"n_cols":14,"rows_kept":504}
[null,null,"Q","r = f(Q)","x","y","r = g(Q)","x","y",null,"Tracing point"]
[{"$nulls":9},"Q","x","y"]
[null,null,{"$f":"a","v":-2},{"$f":"FNA","v":-0.9092974268256817},{"$f":"D3*COS(C3)","v":0.37840124765396416},{"$f":"D3*SIN(C3)","v":0.826821810431806},{"$f":"FNB","v":-0.9333333333333333},{"$f":"G3*COS(C3)","v":0.38840371411066626},{"$f":"G3*SIN(C3)","v":0.8486775983706363},{"$f":"Sheet1!J28","v":-1.8602794411177646},{"$f":"LOOKUP($J3,$C3:$C504,E3:E504)","v":0.2818779961278595},{"$f":"LOOKUP($J3,$C3:$C504,F3:F504)","v":0.9129706954481666},"f(Q)","green"]
[null,null,{"$f":"C3+B$12","v":-1.9900199600798403},-0.913405236743969,{"$f":"D4*COS(C4)","v":0.37180291544210287},{"$f":"D4*SIN(C4)","v":0.8343091265113061},-0.9366266480630052,{"$f":"G4*COS(C4)","v":0.381255224320772},{"$f":"G4*SIN(C4)","v":0.8555196852146995},{"$f":"J3","v":-1.8602794411177646},{"$f":"LOOKUP($J4,$C3:$C504,H3:H504)","v":0.28634252796740506},{"$f":"LOOKUP($J4,$C3:$C504,I3:I504)","v":0.9274308051211172},"T(Q)","red"]
[null,null,{"$f":"C4+B$12","v":-1.9800399201596806},-0.9174220711626155,0.36505646008666814,0.8416632566563033,-0.9398525795199318,0.373981906984288,0.8622415000907027]
[null,null,-1.9700598802395208,-0.9213475300034263,0.35816456931853485,0.8488812710434145,-0.9430101633176302,0.3665856997591389,0.8688400847408262]
[null,null,-1.960079840319361,-0.925181222289248,0.3511299888088189,0.855960294076627,-0.9460984547124027,0.35906861467984585,0.8753125247367896]
[null,null,-1.9500998003992014,-0.9289227661829101,0.343955521075025,0.8628975055329096,-0.9491165285043313,0.3514327369368676,0.8816559510881643]
[null,null,-1.9401197604790417,-0.932571789025256,0.3366440243645472,0.8696901416857665,-0.9520634789382694,0.34368022362684875,0.8878675418190709]
[null,null,-1.930139720558882,-0.93612792737226,0.3291984115159676,0.8763354964062834,-0.9549384196048384,0.33581330247449337,0.893944523512819]
[null,null,-1.9201596806387222,-0.9395908270312266,0.3216216487986056,0.8828309222412245,-0.9577404833414203,0.32783427052678527,0.8998841728240519]
["delta Q = ",{"$f":"(Sheet1!D20-Sheet1!D19)/501","v":0.00998003992015968},-1.9101796407185625,-0.9429601430960681,0.3139167547307815,0.8891738314677573,-0.9604688221331525,0.3197454928202815,0.9056838179579896]
[null,null,-1.9001996007984028,-0.9462355399816575,0.3060867988772642,0.8953616971243791,-0.9631226070139212,0.31154940102221385,0.9113408401163594]
[null,null,-1.890219560878243,-0.9494166914572527,0.29813490062638265,0.9013920540176362,-0.9657010279673552,0.3032484920461355,0.9168526749096343]
[null,null,-1.8802395209580833,-0.9525032806789893,0.29006422794728753,0.9072624997042374,-0.9682032938278211,0.2948453266428551,0.922216813735203]
[null,null,-1.8702594810379236,-0.9554950002214384,0.2818779961278595,0.9129706954481666,-0.9706286321814167,0.28634252796740506,0.9274308051211172]
[null,null,-1.8602794411177639,-0.9583915521082265,0.2735794664937653,0.9185143671524154,-0.972976289266964,0.27774278012279513,0.9324922560350684]
[null,null,-1.8502994011976042,-0.9611926478417134,0.2651719451091733,0.9238913062649642,-0.975245529877005,0.2690488266813071,0.9373988331582732]
[null,null,-1.8403193612774444,-0.9638980084317275,0.25665878145964544,0.9290993706586506,-0.9774356372587946,0.2602634691840875,0.9421482641239485]
[null,null,-1.8303393213572847,-0.9665073644233526,0.24804336711773034,0.9341364854845753,-0.979545913015295,0.25138956561980086,0.9467383387200794]
[null,null,-1.820359281437125,-0.9690204559237663,0.2393291343917895,0.9390006439987039,-0.9815756770061697,0.2424300288831082,0.951166910056198]
[null,null,-1.8103792415169653,-0.971437032628125,0.2305195549585947,0.9436899083613367,-0.9835242672487774,0.23338782521373902,0.9554318956939033]
[null,null,-1.8003992015968056,-0.9737568538444945,0.2216181384802411,0.9482024104091282,-0.9853910398191663,0.22426597261692532,0.9595312787408664]
[null,null,-1.7904191616766458,-0.9759796885178232,0.2126284312059276,0.9525363523993473,-0.9871753687530674,0.21506753926597172,0.9634631089080861]
[null,null,-1.780439121756486,-0.9781053152529547,0.20355401455916097,0.956690007726082,-0.9888766459468897,0.20579564188773525,0.9672255035301671]
[null,null,-1.7704590818363264,-0.9801335223366797,0.19439850371094722,0.9606617216081066,-0.9904942810587133,0.19645344413179083,0.9708166485484139]
[null,null,-1.7604790419161667,-0.982064107758822,0.18516554613953762,0.9644499117481312,-0.9920277014092841,0.18704415492406037,0.9742347994565437]
[null,null,-1.750499001996007,-0.9838968792323588,0.1758588201773044,0.9680530689631749,-0.9934763518830065,0.17757102680568398,0.9774782822088389]
[null,null,-1.7405189620758472,-0.9856316542125731,0.1664820335453241,0.9714697577858133,-0.9948396948289395,0.16803735425791355,0.9805454940905791]
[null,null,-1.7305389221556875,-0.987268259915235,0.1570389218762528,0.9746986170360561,-0.9961172099617889,0.15844647201380807,0.9834349045505941]
[null,null,-1.7205588822355278,-0.9888065333338105,0.14753324722608155,0.9777383603636282,-0.9973083942629023,0.14880175335751306,0.9861450559958096]
[null,null,-1.710578842315368,-0.990246321255698,0.13796879657536515,0.9805877767604431,-0.9984127618812628,0.13910660841190356,0.9886745645476617]
[null,null,-1.7005988023952083,-0.9915874802774876,0.1283493803205208,0.9832457310430568,-0.9994298440344833,0.1293644824153726,0.9910221207602757]
[null,null,-1.6906187624750486,-0.9928298768192441,0.11867883075579859,0.9857111643049153,-1.0003591889097998,0.11957885398854558,0.9931864903003155]
[null,null,-1.6806387225548889,-0.9939733871378124,0.10896100054652774,0.9879830943382154,-1.0012003615650664,0.10975323339170007,0.9951665145884315]
[null,null,-1.6706586826347292,-0.9950178973391413,0.09919976119424714,0.9900606160252059,-1.001952943829749,0.09989116077367079,0.9969611114022395]
[null,null,-1.6606786427145694,-0.9959633033896284,0.08939900149433193,0.9919429016987809,-1.0026165342059183,0.08999620441301713,0.9985692754407868]
[null,null,-1.6506986027944097,-0.996809511126481,0.0795626259867302,0.993629201472214,-1.003190747769246,0.08007195895223068,0.9999900788504711]
[null,null,-1.64071856287425,-0.9975564362670954,0.06969455340042724,0.9951188435379077,-1.003675216069997,0.07012204362575682,1.0012226717123933]
[null,null,-1.6307385229540903,-0.9982040044174512,0.05979871509225697,0.9964112344350349,-1.0040695870340237,0.06015010048260432,1.002266282491139]
[null,null,-1.6207584830339306,-0.9987521510795208,0.049879053480682556,0.9975058592859698,-1.0043735248637604,0.05015979260431391,1.0031202184450012]
[null,null,-1.6107784431137708,-0.9992008216576939,0.03993952047517019,0.9984022820014106,-1.0045867099392176,0.04015480231905421,1.0037838659976657]
[null,null,-1.600798403193611,-0.9995499714642148,0.029984075901781686,0.9991001454541125,-1.0047088387189753,0.03013882941261153,1.0042566910713961]
[null,null,-1.5908183632734514,-0.9997995657236335,0.02001668592561323,0.9995991716211661,-1.0047396236411779,0.020115589337036752,1.0045382393817766]
[null,null,-1.5808383233532917,-0.9999495795762695,0.010041321470708641,0.9998991616947581,-1.0046787930245271,0.010088811417709447,1.0046281366940697]
[null,null,-1.570858283433132,-0.9999999980806875,6.1956638076769645E-5,0.999999996161375,-1.0045260909692768,6.2237059576308033E-5,1.0045260890412773]
[null,null,-1.5608782435129722,-0.9999508162151858,-0.00991743287755681,0.9999016348494163,-1.004281277258227,-0.00996038204668274,1.0042318829039933]
[null,null,-1.5508982035928125,-0.9998020388782964,-0.019892871371633026,0.9996041169451986,-1.0039441272577179,-0.019975285717811205,1.0037453853521583]
[null,null,-1.5409181636726528,-0.9995536808882972,-0.029860384713646444,0.9991075609773439,-1.003514431818623,-0.029978707069709763,1.003066544148833]
[null,null,-1.530938123752493,-0.9992057669817358,-0.03981600193040533,0.9984121647695589,-1.0029919971773447,-0.03996687430700569,1.0021953878161316]
[null,null,-1.5209580838323333,-0.9987583318109662,-0.04975575678803385,0.997518205361824,-1.002376644856807,-0.04993601250972119,1.001132025663458]
[null,null,-1.5109780439121736,-0.9982114199406968,-0.05967568937208618,0.9964260389000222,-1.00166821156745,-0.05988234541630816,0.9998766477782026]
[null,null,-1.5009980039920139,-0.9975650858435524,-0.06957184766514296,0.9951361004940541,-1.0008665491082245,-0.06980209720232239,0.998429524979086]
[null,null,-1.4910179640718542,-0.9968193938946485,-0.07944028912126176,0.9936489040444944,-0.9999715242675848,-0.07969149425401466,0.9967910087323217]
[null,null,-1.4810379241516944,-0.9959744183651789,-0.08927708223665402,0.9919650420378563,-0.9989830187244837,-0.08954676693612228,0.9949615310308082]
[null,null,-1.4710578842315347,-0.9950302434150191,-0.09907830811596305,0.9900851853105522,-0.9979009289493663,-0.09936415135314942,0.9929416042365616]
[null,null,-1.461077844311375,-0.9939869630843438,-0.10884006203351883,0.9880100827816366,-0.9967251661051639,-0.10913989110343104,0.9907318208866099]
[null,null,-1.4510978043912153,-0.9928446812842598,-0.11855845498894776,0.9857405611544435,-0.9954556559482879,-0.11887023902528066,0.9883328534625917]
[null,null,-1.4411177644710556,-0.9916035117864573,-0.12822961525651758,0.9832775245872348,-0.9940923387296244,-0.12855145893452896,0.985745454124308]
[null,null,-1.4311377245508958,-0.9902635782118778,-0.13784968992760027,0.9806219543329918,-0.9926351690955275,-0.13817982735276596,0.9829704544074895]
[null,null,-1.421157684630736,-0.988825014018401,-0.1474148464456383,0.9777749083484908,-0.9910841159888141,-0.1477516352256067,0.9800087648860536]
[null,null,-1.4111776447105764,-0.987287962487553,-0.15692127413300275,0.974737520872824,-0.9894391625497566,-0.15726318963030653,0.9768613747991399]
[null,null,-1.4011976047904167,-0.9856525767102354,-0.16636518570913528,0.9715110019755265,-0.9877003060170791,-0.1667108154720606,0.9735293516432221]
[null,null,-1.391217564870257,-0.9839190195714766,-0.17574281879936854,0.9680966370744959,-0.9858675576289493,-0.1760908571683262,0.9700138407296021]
[null,null,-1.3812375249500972,-0.9820874637342095,-0.18505043743382465,0.9644957864238923,-0.9839409425239731,-0.18539968032051818,0.9663160647076164]
[null,null,-1.3712574850299375,-0.9801580916220731,-0.19428433353579405,0.9607098845722243,-0.98192049964219,-0.1946336733724319,0.9624373230538814]
[null,null,-1.3612774451097778,-0.9781310954012441,-0.2034408283990018,0.9567404397908377,-0.9798062816260653,-0.20378924925475675,0.9583789915279232]
[null,null,-1.351297405189618,-0.9760066769612962,{"$f":"D68*COS(C68)","v":-0.21251627415317334},{"$f":"D68*SIN(C68)","v":0.9525890334730319},-0.9775983547214846,{"$f":"G68*COS(C68)","v":-0.21286284701505256},{"$f":"G68*SIN(C68)","v":0.9541425215945466}]
[null,null,{"$f":"C68+B$12","v":-1.3413173652694583},-0.9737850478950922,-0.221507055217315,0.9482573195040471,-0.9752967986787491,-0.2218509334325681,0.9497294398133158]
[null,null,-1.3313373253492986,-0.9714664294777096,-0.23040958974013123,0.9437470236021697,-0.9729017066535677,-0.23075000461728826,0.9451413471955113]
[null,null,-1.3213572854291389,-0.9690510526444005,-0.23922033102700357,0.9390599426312207,-0.9704131851080521,-0.23955658759260778,0.9403799185289633]
[null,null,-1.3113772455089792,-0.9665391579675918,-0.2479357689529642,0.9341979438847015,-0.967831353711711,-0.24826724186103513,0.9354469016711517]
[null,null,-1.3013972055888194,-0.963930995632923,-0.25655243136109984,0.9291629643418782,-0.9651563452424439,-0.2568785609523405,0.9303441168109821]
[null,null,-1.2914171656686597,-0.9612268254143277,-0.26506688544582996,0.9239570098961064,-0.9623883054875346,-0.26538717395357075,0.9250734556996572]
[null,null,-1.2814371257485,-0.9584269166481607,-0.2734757391205074,0.9185821545557004,-0.9595273931446457,-0.2737897470203622,0.9196368808510703]
[null,null,-1.2714570858283403,-0.9555315482063713,-0.2817756423687971,0.913040539617665,-0.956573779722813,-0.2820829848689936,0.9140364247121598]
[null,null,-1.2614770459081805,-0.9525410084687279,-0.2899632885792944,0.9073343728146211,-0.9535276494434387,-0.290263632248628,0.9082741888036687]
[null,null,-1.2514970059880208,-0.9494555952940954,-0.29803541586285104,0.9014659274352651,-0.9503891991412862,-0.29832847539320484,0.9023523428317685]
[null,null,-1.241516966067861,-0.9462756159907676,-0.3059888083520843,0.8954375414187067,-0.9471586381654734,-0.30627434345245125,0.8962731237710099]
[null,null,-1.2315369261477014,-0.9430013872858604,-0.3138202974825515,0.8892516164230572,-0.9438361882804674,-0.31409810990149223,0.8900388349190793]
[null,null,-1.2215568862275417,-0.9396332352937644,-0.32152676325507923,0.8829106168686268,-0.9404220835670781,-0.3217966939285495,0.8836518449238365]
[null,null,-1.211576846307382,-0.9361714954836646,-0.3291051354787445,0.8764170689561211,-0.9369165703234522,-0.32936706180022834,0.8771145867831323]
[null,null,-1.2015968063872222,-0.9326165126461275,-0.3365523949940134,0.8697735596602246,-0.933319906966068,-0.33680622820390316,0.8704295568179026]
[null,null,-1.1916167664670625,-0.9289686408587593,-0.3438655748755483,0.8629827356989705,-0.929632363930728,-0.3441112575667204,0.8635993136190439]
[null,null,-1.1816367265469028,-0.9252282434509402,-0.35104176161420614,0.8560473024793124,-0.9258542235735542,-0.35127926535075255,0.8566264769685936]
[null,null,-1.171656686626743,-0.9213956929676363,-0.35807809627775566,0.8489700230193108,-0.9219857800719816,-0.35830741932384186,0.8495137267357302]
[null,null,-1.1616766467065833,-0.9174713711322944,-0.36497177564985217,0.8417537168473722,-0.9180273393257525,-0.36519294080568787,0.8422638017481302]
[null,null,-1.1516966067864236,-0.9134556688088216,-0.3717200533468151,0.8344012588789715,-0.9139792188579099,-0.37193310588874157,0.8348794986392164]
[null,null,-1.1417165668662639,-0.9093489859626555,-0.37832024091176397,0.8269155782713098,-0.9098417477157923,-0.3785252466334798,0.8273636706718459]
[null,null,-1.1317365269461042,-0.9051517316209275,-0.384769708885677,0.8192996572563637,-0.9056152663720269,-0.38496675223764576,0.8197192265389878]
[null,null,-1.1217564870259444,-0.9008643238317238,-0.3910658878549457,0.8115565299527888,-0.9013001266255249,-0.3912550701790527,0.8119491291419505]
[null,null,-1.1117764471057847,-0.8964871896224467,-0.3972062694750071,0.8036892811571527,-0.8968966915024743,-0.3973877073315561,0.8040563943467237]
[null,null,-1.101796407185625,-0.8920207649572834,-0.4031884074696472,0.7957010451149771,-0.892405335157334,-0.40336223105381686,0.796044089719006]
[null,null,-1.0918163672654653,-0.887465494693784,-0.409009918605577,0.7875950042720827,-0.8878264427738289,-0.4091762702504834,0.7879153332384986]
[null,null,-1.0818363273453055,-0.8828218325385524,-0.4146684836418923,0.7793743880067279,-0.8831604104659426,-0.41482751640543625,0.7796732919930436]
[null,null,-1.0718562874251458,-0.878090241002058,-0.42016184825403974,0.7710424713430524,-0.8784076451789127,-0.4203137245867486,0.7713211808532017]
[null,null,-1.061876247504986,-0.873271191352569,-0.4254878239319206,0.7626025736463352,-0.8735685645902235,-0.4256327144230282,0.7628622611278582]
[null,null,-1.0518962075848264,-0.8683651635692142,-0.430644288851775,0.7540580573005882,-0.8686435970106011,-0.43078237105081874,0.7542998392014613]
[null,null,-1.0419161676646667,-0.8633726462941765,-0.4356291887214983,0.7454123263690092,-0.8636331812850069,-0.4357606460327487,0.7456372651534947]
[null,null,-1.031936127744507,-0.8582941367840244,-0.4404405375990541,0.7366688252378336,-0.8585377666936319,-0.44056555824613064,0.7368779313607949]
[null,null,-1.0219560878243472,-0.8531301408601846,-0.4450764186836561,0.7278310372441184,-0.8533578128528904,-0.4451951947417214,0.7280252710833254]
[null,null,-1.0119760479041875,-0.8478811728585623,-0.44953498507940615,0.7189024832880113,-0.8480937896164144,-0.4496477115723726,0.7190827570340282]
[null,null,-1.0019960079840278,-0.8425477555783134,-0.4538144605310816,0.7098867204300533,-0.8427461769760473,-0.45392133459130457,0.7100538999333728]
[null,null,-0.992015968063868,-0.8371304202297727,-0.4579131401317803,0.7007873404740758,-0.837315464962838,-0.458014360219756,0.7009422470492281]
[null,null,-0.9820359281437083,-0.8316297063815461,-0.4618293910021415,0.6916079685362566,-0.8318021535480354,-0.4619251561837706,0.6917513807226904]
[null,null,-0.9720558882235486,-0.8260461619067687,-0.4655616529408706,0.6823522616009036,-0.8262067525440817,-0.46565216221989403,0.6824849168804941]
[null,null,-0.9620758483033889,-0.8203803429285368,-0.4691084390463107,0.6730239070635436,-0.8205297815056066,-0.4691938907495686,0.6731465035346469]
[null,null,-0.9520958083832292,-0.8146328137645175,-0.4724683363088116,0.663626621261895,-0.8147717696304219,-0.4725489275220244,0.6637398192699258]
[null,null,-0.9421157684630694,-0.8088041468707428,-0.4756400061736608,0.65416414799531,-0.8089332556605147,-0.47571593222547665,0.654268571719875]
[null,null,-0.9321357285429097,-0.8028949227845926,-0.4786221850743524,0.644640257033277,-0.8030147877830421,-0.47869363906645496,0.6447364960319516]
[null,null,-0.92215568862275,-0.7969057300669729,-0.48141368493598113,0.635058742613575,-0.7970169235313251,-0.48148085731709844,0.6351473533224633]
[null,null,-0.9121756487025903,-0.7908371652436951,-0.48401339364856194,0.6254234219306835,-0.7909402296858423,-0.4840764718302668,0.6255049291219487]
[null,null,-0.9021956087824305,-0.7846898327460615,-0.4864202755100847,0.615738133615042,-0.7847852821752239,-0.48647944352232714,0.6158130318116471]
[null,null,-0.8922155688622708,-0.7784643448506643,-0.48863337163912934,0.606006736203774,-0.7785526659772463,-0.4886888098234909,0.6060754910517151]
[null,null,-0.8822355289421111,-0.7721613216184018,-0.49065180035687617,0.596233106603477,-0.7722429750198256,-0.4907036850955858,0.596296156201835]
[null,null,-0.8722554890219514,-0.7657813908327208,-0.4924747575383592,0.5864211385456962,-0.7658568120820121,-0.4925232610171621,0.5864788947348769]
[null,null,-0.8622754491017917,-0.7593251879370888,-0.4941015169328224,0.5765747410356953,-0.7593947886949834,-0.4941468069358432,0.5766275906442642]
[null,null,-0.8522954091816319,-0.7527933559717038,-0.4955314304530529,0.5666978367951404,-0.7528575250430398,-0.49557367018784565,0.566746142845701]
[null,null,-0.8423153692614722,-0.7461865455094471,-0.49676392843357225,0.5567943606993221,-0.7462456498645972,-0.4968032763846022,0.5568384635739162]
[null,null,-0.8323353293413125,-0.7395054145910859,-0.497798519857587,0.5468682582095338,-0.7395598003531815,-0.49783512966643806,0.5469084767750801]
{"$rows_left_out":385}
{"sheet":"Sheet3","index":2,"n_rows":0,"n_cols":0,"rows_kept":0}